{"text_format":"1","workbook":"xlsx","n_sheets":12,"sheets":["Dateneingabe und Ergebnisse","Einfluss IKD","Einfluss EW_CSB120","Kostenentwicklung","Bemessung","Betriebskostenersparnis","Berechnung Grafik_Statisch","Berechnung Grafik Statisch 2","Berechnung Grafik_Dynamisch","Berechnung Grafik Dynamisch  2"," t_TS --> OVC","Fixe Parameter"],"not_rendered":{"charts":7,"images":2,"macros":1,"external_links":0,"defined_names":29,"comments":3,"pivot_tables":0},"unopened":[{"sheet":"Einfluss IKD","index":1,"reason":"not_a_worksheet"},{"sheet":"Einfluss EW_CSB120","index":2,"reason":"not_a_worksheet"},{"sheet":"Kostenentwicklung","index":3,"reason":"not_a_worksheet"}],"bounds":{"document_bytes":16777216,"sheet_cells":100000,"rows_first":2000,"rows_last":500,"rows_between":2000,"halvings":0,"cell_chars":16384,"cell_head_chars":4096},"cells_cut":0,"cells_raw":0,"read":"whole","date_system":"1900"}

{"sheet":"Dateneingabe und Ergebnisse","index":0,"n_rows":491,"n_cols":26,"rows_kept":491,"cut":false,"hidden":false,"merged":[[95,0,109,8],[80,0,80,8],[71,3,72,8],[9,0,10,0],[73,0,74,0],[71,0,72,2],[26,0,27,2],[34,0,35,2],[83,3,83,8],[91,0,94,0],[81,0,82,2],[85,0,86,2],[87,0,90,0],[39,0,40,0],[58,0,59,0],[28,0,30,0],[34,3,35,8],[26,3,27,8],[41,0,41,8],[22,0,24,0],[25,0,25,8],[36,0,38,0],[33,0,33,8],[31,0,32,0],[0,3,0,5],[11,0,13,0],[14,0,15,0],[16,0,21,0],[0,6,0,8],[1,3,1,5],[1,6,1,8],[0,0,2,2],[5,0,6,0],[7,0,8,0],[84,0,84,8],[85,3,86,8],[81,3,82,8],[60,0,60,8],[42,0,43,2],[42,3,43,8],[49,0,49,8],[50,0,50,8],[44,0,48,0],[51,0,57,0],[61,3,62,8],[70,0,70,8],[61,0,62,2],[63,0,64,0],[65,0,68,0],[75,0,79,0]]}
["                         ",null,null,"Variante A:",null,null,"Variante F:"]
[null,null,null,"AEROBE  STABILISIERUNG",null,null,"FAULUNG"]
[null,null,null,"Nr.","Plausibilitäts-                          bereich","Eingabe ","Nr.","Plausibilitäts-                          bereich","Eingabe "]
[null,"                                                                                           D A T E N E I N G A B E B E R E I C H    I"]
["I: Mittlere Belastung der Kläranlage","Mittlere CSB-Belastung (siehe Handbuch)","EWCSB120","1A","2.000 - 40.000",15000,"1F",null,{"$f":"F5","v":15000}]
["II: Bemessungsbelastungen","CSB-Bemessungsbelastung Belebung ","EWCSB120","2A",null,20000,"2F",null,{"$f":"F6","v":20000}]
[null,"CSB-Bemessungsbelastung Faulung ","EWCSB120",null,null,null,"3F","s. Handbuch",17000]
["III: Wirkungsgrade","Mittlere Entfernung CSB","%","4A","85 - 98",95,"4F",null,{"$f":"F8","v":95}]
{"$rows_left_out":484}
{"sheet":"Bemessung","index":4,"n_rows":67,"n_cols":72,"rows_kept":67,"cut":false,"hidden":true,"merged":[[2,12,2,27],[2,28,2,32],[2,33,2,52],[32,54,32,60],[0,1,0,8],[29,1,29,8],[2,1,2,10],[32,1,32,10],[32,12,32,27],[32,62,32,71],[5,0,24,0],[35,0,54,0],[32,28,32,32],[32,33,32,52]]}
[null,"VARIANTE    A",null,null,null,null,null,null,null,null,null,null,null,null,null,null,null,"iN,ÜS=","NO3_ab/Nges_zu","Nges_ab/Nges_zu",null,null,null,null,null,"CS",{"$f":"'Fixe Parameter'!C2","v":13},null,null,null,null,null,null,null,"CSB/oTS",null,"TS/CSB (rückgerechnet)"]
[null,null,null,null,null,null,null,null,null,null,null,null,null,null,null,null,null,{"$f":"'Fixe Parameter'!C6","v":0.06},{"$f":"T2/2","v":7.4999999999999997E-2},{"$f":"(100-'Dateneingabe und Ergebnisse'!F9)/100","v":0.15},null,null,null,null,null,"CX",{"$f":"'Fixe Parameter'!C3","v":1.5},null,null,null,null,null,null,null,{"$f":"'Fixe Parameter'!C5","v":1.45},null,{"$f":"AK6/AH6","v":1.2539184952978055}]
[null,"ZULAUFFRACHTEN",null,null,null,null,null,null,null,null,null,"SCHLAMMALTER","SAUERSTOFFBEDARF BELEBUNG ",null,null,null,null,null,null,null,null,null,null,null,null,null,null,null,"ENERGIE UND BELÜFTUNGSKOSTEN",null,null,null,null,"SCHLAMM"]
[null,"Einwohnerwerte CSB","CSB-Zulauffracht","N-Zulauffracht","N-Rückbelastung","Anteil N-Rückbelastung","VK","hVK","CSB-Zulauffracht Belebung","N-Zulauffracht Belebung","N:CSB","Schlammalter","CSB-OVC","CSB-Entfernung                 ( hges)","Hilfsgröße:                                    hBB bei hges                        mit Einfluss von hVK ","CSB-Entfernung","OVC","XorgN,BM","NO3-N,ab","Nges,ab","NO3-N (OVN)","OVN","NO3-N (OVD)","OVD","N-Entferunung IST","OV_GES","Sättigungsfaktor","erfαOC=","SAE","erforderliche Belüftungsenergie","Kontrolle über LINDNER","Strompreis","Belüftungskosten","CSBÜS","oTS-ÜS vor Faulung","oTS-Gehalt-ÜS","TS-ÜS vor Faulung","TS-ÜS vor Faulung","CSBPS","oTS-PS vor Faulung","oTS-Gehalt-PS","oTS-Schlamm vor Faulung","TS-Schlamm vor Faulung","spez. oTS-Gehalt nach Faulung","oTS-Schlamm nach Faulung","oTS-Reduktion in Faulung","CSB-Reduktion in Faulung","oTS-Reduktion in Faulung","TS-Schlamm nach Faulung_ALT","TS-Gehalt","zu entsorgende Schlammfracht","spez. Schlamm-Entsorgungskosten","Schlammentsorgungs- kosten"]
[null,"EW120","kg CSB/Jahr","kg N/Jahr","kg N/Jahr","%","-","%","kg CSB/Jahr","kg N/Jahr","-","t","%","%","%","kg CSB/Jahr","kg O2/Jahr","kg N/Jahr","kg N/Jahr","kg N/Jahr","kg N/Jahr","kg O2/Jahr","kg N/Jahr","kgO2/Jahr","%","kgO2/Jahr","-","kg O2/Jahr","kg O2/kWh","kWh/Jahr","kWh/(EW·a)","Euro/kWh","Euro/Jahr","kg CSB/Jahr","kg oTS/Jahr","%","kg TS/Jahr","kg TS/Tag","kg CSB/Jahr","kg oTS/Jahr","%","kg oTS/Jahr","kg TS/Jahr","g oTS/(EW120·d)","kg oTS/Jahr","kg oTS/Jahr","kg CSB/Jahr","%","kg TS/Jahr","%","t/Jahr","Euro/t","Euro/Jahr"]
["Berechnung allgemeine Kurvenschaar",2000,{"$f":"B6*0.12*365","v":87600},{"$f":"B6*0.011*365","v":8030},0,0,{"$f":"'Dateneingabe und Ergebnisse'!F10","v":"NEIN"},{"$f":"IF('Dateneingabe und Ergebnisse'!F11=\"–\",0,'Dateneingabe und Ergebnisse'!F11)","v":0},{"$f":"IF(G6=\"NEIN\",C6,C6*(1-H6/100))","v":87600},{"$f":"B6*0.011*365+E6","v":8030},{"$f":"J6/I6","v":9.166666666666666E-2},{"$f":"'Dateneingabe und Ergebnisse'!F12","v":30},{"$f":"IF(G6=\"NEIN\",IF(L6<=35,9.4345*LN(L6)+32.468-1,65),IF(L6<=35,8.8152*LN(L6)+39.505-1,70))","v":63.55659669729161},{"$f":"'Dateneingabe und Ergebnisse'!F8","v":95},{"$f":"(N6-H6)/(100-H6)*100","v":95},{"$f":"I6*O6/100","v":83220},{"$f":"P6*M6/100","v":52891.799771486076},{"$f":"AH6*$R$2","v":1819.6920137108352},{"$f":"J6*$S$2","v":602.25},{"$f":"J6*$T$2","v":1204.5},{"$f":"J6-R6-T6+S6","v":5608.0579862891645},{"$f":"U6*4.3","v":24114.649341043405},{"$f":"J6-R6-T6","v":5005.8079862891645},{"$f":"W6*2.9","v":14516.843160238577},{"$f":"100-T6/J6*100","v":85},{"$f":"Q6+V6-X6","v":62489.605952290913},{"$f":"($AA$1/($AA$1-$AA$2))","v":1.1304347826086956},{"$f":"Z6*AA6","v":70640.42411998102},{"$f":"'Dateneingabe und Ergebnisse'!F15","v":2},{"$f":"AB6/AC6","v":35320.21205999051},{"$f":"AD6/B6","v":17.660106029995255},{"$f":"'Dateneingabe und Ergebnisse'!F16","v":0.14000000000000001},{"$f":"AD6*AF6","v":4944.8296883986723},{"$f":"P6*((100-M6)/100)","v":30328.200228513921},{"$f":"AH6/$AI$2","v":20916.000157595809},{"$f":"'Dateneingabe und Ergebnisse'!F18","v":55},{"$f":"AI6/AJ6*100","v":38029.091195628738},{"$f":"AK6/365","v":104.18929094692805},{"$f":"C6-I6","v":0},{"$f":"AM6/$AI$2","v":0},{"$f":"'Dateneingabe und Ergebnisse'!F17","v":"–"},{"$f":"AI6+AN6","v":20916.000157595809},{"$f":"IF(AO6<>\"–\",AK6+AN6/AO6*100,AK6)","v":38029.091195628738},"-","-","-",null,"-",{"$f":"AQ6","v":38029.091195628738},{"$f":"'Dateneingabe und Ergebnisse'!F21","v":24},{"$f":"AW6/(AX6/100)/1000","v":158.45454664845309},{"$f":"'Dateneingabe und Ergebnisse'!F22","v":60},{"$f":"AY6*AZ6","v":9507.2727989071846}]
[null,4000,175200,16060,{"$f":"E6","v":0},{"$f":"F6","v":0},{"$f":"G6","v":"NEIN"},{"$f":"H6","v":0},175200,16060,9.166666666666666E-2,{"$f":"L6","v":30},{"$f":"IF(G7=\"NEIN\",IF(L7<=35,9.4345*LN(L7)+32.468-1,65),IF(L7<=35,8.8152*LN(L7)+39.505-1,70))","v":63.55659669729161},{"$f":"N6","v":95},{"$f":"(N7-H7)/(100-H7)*100","v":95},{"$f":"I7*O7/100","v":166440},{"$f":"P7*M7/100","v":105783.59954297215},3639.3840274216705,{"$f":"J7*$S$2","v":1204.5},{"$f":"J7*$T$2","v":2409},11216.115972578329,{"$f":"U7*4.3","v":48229.29868208681},{"$f":"J7-R7-T7","v":10011.615972578329},{"$f":"W7*2.9","v":29033.686320477154},{"$f":"100-T7/J7*100","v":85},124979.21190458183,{"$f":"($AA$1/($AA$1-$AA$2))","v":1.1304347826086956},141280.84823996204,{"$f":"AC6","v":2},70640.42411998102,17.660106029995255,{"$f":"AF6","v":0.14000000000000001},9889.6593767973445,{"$f":"P7*((100-M7)/100)","v":60656.400457027841},41832.000315191617,{"$f":"AJ6","v":55},{"$f":"AI7/AJ7*100","v":76058.182391257476},{"$f":"AK7/365","v":208.37858189385611},0,0,{"$f":"AO6","v":"–"},41832.000315191617,{"$f":"IF(AO7<>\"–\",AK7+AN7/AO7*100,AK7)","v":76058.182391257476},{"$f":"AR6","v":"-"},{"$f":"AS6","v":"-"},{"$f":"AT6","v":"-"},null,{"$f":"AV6","v":"-"},76058.182391257476,{"$f":"AX6","v":24},316.90909329690618,{"$f":"AZ6","v":60},19014.545597814369]
[null,6000,262800,24090,{"$f":"E7","v":0},0,"NEIN",0,262800,24090,9.166666666666666E-2,30,63.55659669729161,{"$f":"N7","v":95},95,249660,158675.39931445825,5459.0760411325055,1806.75,3613.5,16824.173958867494,72343.948023130215,15017.423958867494,{"$f":"W8*2.9","v":43550.529480715733},85,187468.81785687275,1.1304347826086956,211921.27235994308,2,105960.63617997154,17.660106029995255,0.14000000000000001,14834.489065196016,{"$f":"P8*((100-M8)/100)","v":90984.600685541765},62748.000472787426,55,{"$f":"AI8/AJ8*100","v":114087.27358688622},312.56787284078416,0,0,{"$f":"AO7","v":"–"},62748.000472787426,114087.27358688622,{"$f":"AR7","v":"-"},{"$f":"AS7","v":"-"},{"$f":"AT7","v":"-"},null,{"$f":"AV7","v":"-"},114087.27358688622,24,475.36363994535924,60,28521.818396721555]
{"$rows_left_out":60}
{"sheet":"Betriebskostenersparnis","index":5,"n_rows":24,"n_cols":9,"rows_kept":24,"cut":false,"hidden":true,"merged":[[0,1,0,4],[3,0,22,0]]}
[null,"Reduktion (+) / Erhöhung (-) laufender Kosten"]
[null,"Einwohnerwerte","Belüftungskostenersparnis","Schlammentsorgungskostenersparnis","Betriebskostenersparnis","jährliche Einsp. aus Eingenstromproduktion","etwaige Erhöhung durch  zusätzliche Personalkosten","etwaige Erhöhung durch  zusätliche Betriebskosten","Gesamtreduktion"]
[null,"EW","Euro/Jahr","Euro/Jahr","Euro/Jahr","Euro/Jahr","Euro/Jahr","Euro/Jahr","Euro/Jahr"]
["Berechnung allgemeine Kurvenschaar",2000,{"$f":"Bemessung!AG6-Bemessung!AG36","v":361.96857544097657},{"$f":"Bemessung!BA6-Bemessung!BA36","v":2342.7773406235829},{"$f":"D4+C4","v":2704.7459160645594},{"$f":"Bemessung!BT36","v":0},{"$f":"G24","v":0},{"$f":"$H$24*(B4/$B$24)","v":0},{"$f":"(IF(E4+F4-G4-H4<0,0,E4+F4-G4-H4))","v":2704.7459160645594}]
[null,4000,{"$f":"Bemessung!AG7-Bemessung!AG37","v":723.93715088195313},{"$f":"Bemessung!BA7-Bemessung!BA37","v":4685.5546812471657},5409.4918321291188,{"$f":"Bemessung!BT37","v":0},{"$f":"G4","v":0},{"$f":"$H$24*(B5/$B$24)","v":0},{"$f":"(IF(E5+F5-G5-H5<0,0,E5+F5-G5-H5))","v":5409.4918321291188}]
[null,6000,{"$f":"Bemessung!AG8-Bemessung!AG38","v":1085.9057263229261},{"$f":"Bemessung!BA8-Bemessung!BA38","v":7028.3320218707522},8114.2377481936783,{"$f":"Bemessung!BT38","v":0},{"$f":"G5","v":0},0,8114.2377481936783]
[null,8000,{"$f":"Bemessung!AG9-Bemessung!AG39","v":1447.8743017639063},{"$f":"Bemessung!BA9-Bemessung!BA39","v":9371.1093624943314},10818.983664258238,{"$f":"Bemessung!BT39","v":0},0,0,10818.983664258238]
[null,10000,{"$f":"Bemessung!AG10-Bemessung!AG40","v":1809.8428772048828},{"$f":"Bemessung!BA10-Bemessung!BA40","v":11713.886703117925},13523.729580322808,{"$f":"Bemessung!BT40","v":0},0,0,13523.729580322808]
{"$rows_left_out":17}
{"sheet":"Berechnung Grafik_Statisch","index":6,"n_rows":35,"n_cols":13,"rows_kept":35,"cut":false,"hidden":true,"merged":[[2,2,2,12],[0,2,0,12],[33,2,33,12]]}
["Berechnung statische                                             Armotisationszeit","ALLGEMEIN","Investitionskostendifferenz"]
["Betriebskostenänderung","Einwohnerwerte",0,{"$f":"200000","v":200000},{"$f":"D2+200000","v":400000},{"$f":"E2+200000","v":600000},800000,1000000,1200000,1400000,1600000,1800000,2000000]
["Euro/Jahr","EW","Amortisationszeit"]
[{"$f":"Betriebskostenersparnis!I4","v":2704.7459160645594},2000,{"$f":"IF(C$2/$A4>50,#N/A,C$2/$A4)","v":0},{"$f":"IF(D$2/$A4>50,#N/A,D$2/$A4)","v":{"$error":"#N/A"}},{"$f":"IF(E$2/$A4>50,#N/A,E$2/$A4)","v":{"$error":"#N/A"}},{"$error":"#N/A"},{"$error":"#N/A"},{"$error":"#N/A"},{"$error":"#N/A"},{"$error":"#N/A"},{"$error":"#N/A"},{"$error":"#N/A"},{"$error":"#N/A"}]
[{"$f":"Betriebskostenersparnis!I5","v":5409.4918321291188},4000,{"$f":"IF(C$2/$A5>50,#N/A,C$2/$A5)","v":0},{"$f":"IF(D$2/$A5>50,#N/A,D$2/$A5)","v":36.972049539315435},{"$error":"#N/A"},{"$error":"#N/A"},{"$error":"#N/A"},{"$error":"#N/A"},{"$error":"#N/A"},{"$error":"#N/A"},{"$error":"#N/A"},{"$error":"#N/A"},{"$error":"#N/A"}]
[{"$f":"Betriebskostenersparnis!I6","v":8114.2377481936783},6000,0,24.648033026210289,49.296066052420578,{"$error":"#N/A"},{"$error":"#N/A"},{"$error":"#N/A"},{"$error":"#N/A"},{"$error":"#N/A"},{"$error":"#N/A"},{"$error":"#N/A"},{"$error":"#N/A"}]
[{"$f":"Betriebskostenersparnis!I7","v":10818.983664258238},8000,0,18.486024769657718,36.972049539315435,{"$error":"#N/A"},{"$error":"#N/A"},{"$error":"#N/A"},{"$error":"#N/A"},{"$error":"#N/A"},{"$error":"#N/A"},{"$error":"#N/A"},{"$error":"#N/A"}]
[{"$f":"Betriebskostenersparnis!I8","v":13523.729580322808},10000,0,14.788819815726162,29.577639631452325,44.366459447178485,{"$error":"#N/A"},{"$error":"#N/A"},{"$error":"#N/A"},{"$error":"#N/A"},{"$error":"#N/A"},{"$error":"#N/A"},{"$error":"#N/A"}]
{"$rows_left_out":28}
{"sheet":"Berechnung Grafik Statisch 2","index":7,"n_rows":37,"n_cols":16,"rows_kept":37,"cut":false,"hidden":true,"merged":[[1,4,1,7],[1,1,1,3]]}
[]
[null,"Variante: Aaerobe Stabilisierung",null,null,"Variante: Anaerobe Stabilisierung"]
["Jahre","Investitionskosten","Laufende Kosten","Gesamtkosten","Investitionskosten","Laufende Kosten","Einsparung Eigenstrom","Gesamtkosten","Jahre","Gesamtkosten Aerobe Stabilsierung","Gesamtkosten Anerobe Stabilsierung","Differenz","Betrag der Differenz",null,"Kontrolle Betriebskostenersparnis","Kontrolle Amortisationszeit"]
[null,null,null,null,null,null,null,null,null,"Mio. Euro","Mio. Euro","Euro"]
[0,{"$f":"'Dateneingabe und Ergebnisse'!F64","v":600000},0,{"$f":"B5+C5","v":600000},{"$f":"'Dateneingabe und Ergebnisse'!I64","v":800000},0,0,{"$f":"E5+F5-G5","v":800000},0,{"$f":"D5/1000000","v":0.6},{"$f":"H5/1000000","v":0.8},{"$f":"(K5-J5)*1000000","v":200000.00000000006},{"$f":"ABS(L5)","v":200000.00000000006},null,{"$f":"C5-F5+G5","v":0},{"$f":"(E5+E19)/O6","v":55.211593978711022}]
[1,0,{"$f":"Bemessung!BA26+Bemessung!AG26","v":108390.76865479394},{"$f":"D5+C6+B6","v":708390.76865479397},0,{"$f":"Bemessung!BA56+Bemessung!AG56","v":88105.174284309731},{"$f":"Bemessung!BT56","v":0},{"$f":"H5+E6+F6-G6","v":888105.17428430973},{"$f":"A6","v":1},{"$f":"D6/1000000","v":0.708390768654794},{"$f":"H6/1000000","v":0.88810517428430968},{"$f":"(K6-J6)*1000000","v":179714.40562951568},{"$f":"ABS(L6)","v":179714.40562951568},null,20285.594370484207]
[2,{"$f":"B6","v":0},{"$f":"C6","v":108390.76865479394},{"$f":"D6+C7+B7","v":816781.53730958793},0,{"$f":"F6","v":88105.174284309731},{"$f":"G6","v":0},{"$f":"H6+E7+F7-G7","v":976210.34856861946},2,0.81678153730958791,0.97621034856861943,159428.81125903153,159428.81125903153,null,20285.594370484207]
[3,{"$f":"B7","v":0},{"$f":"C7","v":108390.76865479394},925172.3059643819,0,{"$f":"F7","v":88105.174284309731},{"$f":"G7","v":0},1064315.5228529293,3,0.92517230596438194,1.0643155228529293,139143.21688854735,139143.21688854735,null,20285.594370484207]
{"$rows_left_out":30}
{"sheet":"Berechnung Grafik_Dynamisch","index":8,"n_rows":37,"n_cols":27,"rows_kept":37,"cut":false,"hidden":true,"merged":[[35,16,35,26],[35,2,35,12],[2,6,2,12],[0,2,0,12],[0,16,0,26],[2,16,2,26]]}
["Berechnung Diskontierungsfaktor für dynamische Armotisationszeit","ALLGEMEIN","Investitionskostendifferenz",null,null,null,null,null,null,null,null,null,null,null,"dynamische Amortisationszeit","ALLGEMEIN","Investitionskostendifferenz"]
["Betriebskostenänderung","Einwohnerwerte",0,200000,{"$f":"D2+200000","v":400000},{"$f":"E2+200000","v":600000},800000,1000000,1200000,1400000,1600000,1800000,2000000,null,"Zinsatz für Tabelle","Einwohnerwerte",0,200000,{"$f":"R2+200000","v":400000},{"$f":"S2+200000","v":600000},{"$f":"T2+200000","v":800000},{"$f":"U2+200000","v":1000000},{"$f":"V2+200000","v":1200000},{"$f":"W2+200000","v":1400000},{"$f":"X2+200000","v":1600000},{"$f":"Y2+200000","v":1800000},{"$f":"Z2+200000","v":2000000}]
["Euro/Jahr","EW",null,null,null,null,"Euro",null,null,null,null,null,null,null,{"$f":"IF(O5=0,0.00000000001,O5)","v":0.03},"EW","Amortisationszeit"]
[{"$f":"Betriebskostenersparnis!I4","v":2704.7459160645594},2000,{"$f":"C$2/$A4","v":0},{"$f":"D$2/$A4","v":73.94409907863087},{"$f":"E$2/$A4","v":147.88819815726174},221.83229723589261,{"$f":"G$2/$A4","v":295.77639631452348},369.72049539315435,443.66459447178522,517.60869355041609,591.55279262904696,665.49689170767783,{"$f":"M$2/$A4","v":739.4409907863087},null,"Zinssatz von Eingabe =",2000,0,{"$f":"IF(ISERROR(LOG(1/(1-$O$3*D4),1+$O$3)),#N/A,IF(LOG(1/(1-$O$3*D4),1+$O$3)>50,#N/A,LOG(1/(1-$O$3*D4),1+$O$3)))","v":{"$error":"#N/A"}},{"$f":"IF(ISERROR(LOG(1/(1-$O$3*E4),1+$O$3)),#N/A,IF(LOG(1/(1-$O$3*E4),1+$O$3)>50,#N/A,LOG(1/(1-$O$3*E4),1+$O$3)))","v":{"$error":"#N/A"}},{"$error":"#N/A"},{"$error":"#N/A"},{"$error":"#N/A"},{"$error":"#N/A"},{"$error":"#N/A"},{"$error":"#N/A"},{"$error":"#N/A"},{"$error":"#N/A"}]
[{"$f":"Betriebskostenersparnis!I5","v":5409.4918321291188},4000,{"$f":"C$2/$A5","v":0},36.972049539315435,73.94409907863087,110.91614861794631,147.88819815726174,184.86024769657718,221.83229723589261,258.80434677520805,295.77639631452348,332.74844585383892,369.72049539315435,null,{"$f":"'Dateneingabe und Ergebnisse'!F58/100","v":0.03},4000,0,{"$error":"#N/A"},{"$f":"IF(ISERROR(LOG(1/(1-$O$3*E5),1+$O$3)),#N/A,IF(LOG(1/(1-$O$3*E5),1+$O$3)>50,#N/A,LOG(1/(1-$O$3*E5),1+$O$3)))","v":{"$error":"#N/A"}},{"$f":"IF(ISERROR(LOG(1/(1-$O$3*F5),1+$O$3)),#N/A,IF(LOG(1/(1-$O$3*F5),1+$O$3)>50,#N/A,LOG(1/(1-$O$3*F5),1+$O$3)))","v":{"$error":"#N/A"}},{"$f":"IF(ISERROR(LOG(1/(1-$O$3*G5),1+$O$3)),#N/A,IF(LOG(1/(1-$O$3*G5),1+$O$3)>50,#N/A,LOG(1/(1-$O$3*G5),1+$O$3)))","v":{"$error":"#N/A"}},{"$f":"IF(ISERROR(LOG(1/(1-$O$3*H5),1+$O$3)),#N/A,IF(LOG(1/(1-$O$3*H5),1+$O$3)>50,#N/A,LOG(1/(1-$O$3*H5),1+$O$3)))","v":{"$error":"#N/A"}},{"$f":"IF(ISERROR(LOG(1/(1-$O$3*I5),1+$O$3)),#N/A,IF(LOG(1/(1-$O$3*I5),1+$O$3)>50,#N/A,LOG(1/(1-$O$3*I5),1+$O$3)))","v":{"$error":"#N/A"}},{"$f":"IF(ISERROR(LOG(1/(1-$O$3*J5),1+$O$3)),#N/A,IF(LOG(1/(1-$O$3*J5),1+$O$3)>50,#N/A,LOG(1/(1-$O$3*J5),1+$O$3)))","v":{"$error":"#N/A"}},{"$f":"IF(ISERROR(LOG(1/(1-$O$3*K5),1+$O$3)),#N/A,IF(LOG(1/(1-$O$3*K5),1+$O$3)>50,#N/A,LOG(1/(1-$O$3*K5),1+$O$3)))","v":{"$error":"#N/A"}},{"$f":"IF(ISERROR(LOG(1/(1-$O$3*L5),1+$O$3)),#N/A,IF(LOG(1/(1-$O$3*L5),1+$O$3)>50,#N/A,LOG(1/(1-$O$3*L5),1+$O$3)))","v":{"$error":"#N/A"}},{"$f":"IF(ISERROR(LOG(1/(1-$O$3*M5),1+$O$3)),#N/A,IF(LOG(1/(1-$O$3*M5),1+$O$3)>50,#N/A,LOG(1/(1-$O$3*M5),1+$O$3)))","v":{"$error":"#N/A"}}]
[{"$f":"Betriebskostenersparnis!I6","v":8114.2377481936783},6000,0,24.648033026210289,49.296066052420578,73.94409907863087,98.592132104841156,123.24016513105146,147.88819815726174,172.53623118347204,197.18426420968231,221.83229723589261,246.48033026210291,null,null,6000,0,45.500014160168888,{"$error":"#N/A"},{"$error":"#N/A"},{"$error":"#N/A"},{"$error":"#N/A"},{"$error":"#N/A"},{"$error":"#N/A"},{"$error":"#N/A"},{"$error":"#N/A"},{"$error":"#N/A"}]
[{"$f":"Betriebskostenersparnis!I7","v":10818.983664258238},8000,0,18.486024769657718,36.972049539315435,55.458074308973153,73.94409907863087,92.430123848288588,110.91614861794631,129.40217338760402,147.88819815726174,166.37422292691946,184.86024769657718,null,null,8000,0,27.36035389364168,{"$error":"#N/A"},{"$error":"#N/A"},{"$error":"#N/A"},{"$error":"#N/A"},{"$error":"#N/A"},{"$error":"#N/A"},{"$error":"#N/A"},{"$error":"#N/A"},{"$error":"#N/A"}]
[{"$f":"Betriebskostenersparnis!I8","v":13523.729580322808},10000,0,14.788819815726162,29.577639631452325,44.366459447178485,59.155279262904649,73.944099078630813,88.73291889435697,103.52173871008314,118.3105585258093,133.09937834153547,147.88819815726163,null,null,10000,0,19.837878222110046,{"$error":"#N/A"},{"$error":"#N/A"},{"$error":"#N/A"},{"$error":"#N/A"},{"$error":"#N/A"},{"$error":"#N/A"},{"$error":"#N/A"},{"$error":"#N/A"},{"$error":"#N/A"}]
{"$rows_left_out":30}
{"sheet":"Berechnung Grafik Dynamisch  2","index":9,"n_rows":37,"n_cols":21,"rows_kept":37,"cut":false,"hidden":true,"merged":[[1,1,1,5],[1,6,1,12]]}
[]
[null,"Variante: Aaerobe Stabilisierung",null,null,null,null,"Variante: Anaerobe Stabilisierung"]
["Jahre","Investitionskosten","Diskontierte Investitionskosten","Laufende Kosten","Diskontierte Betriebskosten","Gesamtkosten","Investitionskosten","Diskontierte Investitionskosten","Laufende Kosten","Einsparung Eigenstrom","Betriebskosten Gesamt","Diskontierete Betriebskosten","Gesamtkosten","Jahre","Gesamtkosten Aerobe Stabilsierung","Gesamtkosten Anerobe Stabilsierung","Differenz",null,null,"Kontrolle Betriebskostenersparnis","Kontrolle Amortisationszeit"]
[null,null,null,null,null,null,null,null,null,null,null,null,null,null,"Mio. Euro","Mio. Euro"]
[0,{"$f":"'Dateneingabe und Ergebnisse'!F64","v":600000},{"$f":"B5","v":600000},0,null,{"$f":"B5+E5","v":600000},{"$f":"'Dateneingabe und Ergebnisse'!I64","v":800000},{"$f":"G5","v":800000},0,0,{"$f":"I5+J5","v":0},0,{"$f":"G5","v":800000},0,{"$f":"F5/1000000","v":0.6},{"$f":"M5/1000000","v":0.8},{"$f":"(P5-O5)*1000000","v":200000.00000000006},null,null,{"$f":"D5-I5+J5","v":0},{"$f":"(G5+G19)/T6","v":55.211593978711022}]
[1,null,null,{"$f":"'Dateneingabe und Ergebnisse'!F70","v":108390.76865479394},{"$f":"D6/(1+'Dateneingabe und Ergebnisse'!$F$58/100)^A6","v":105233.7559755281},{"$f":"F5+E6","v":705233.75597552815},0,null,{"$f":"'Dateneingabe und Ergebnisse'!I66+'Dateneingabe und Ergebnisse'!I67+'Dateneingabe und Ergebnisse'!I68","v":88105.174284309731},{"$f":"Bemessung!BT56","v":0},{"$f":"I6-J6","v":88105.174284309731},{"$f":"K6/(1+'Dateneingabe und Ergebnisse'!$F$58/100)^A6","v":85539.004159524004},{"$f":"M5+L6","v":885539.00415952399},{"$f":"A6","v":1},{"$f":"F6/1000000","v":0.70523375597552818},{"$f":"M6/1000000","v":0.88553900415952402},{"$f":"(P6-O6)*1000000","v":180305.24818399583},null,null,20285.594370484207]
[2,null,null,{"$f":"D6","v":108390.76865479394},{"$f":"D7/(1+'Dateneingabe und Ergebnisse'!$F$58/100)^A7","v":102168.69512187195},{"$f":"F6+E7","v":807402.45109740016},0,null,{"$f":"I6","v":88105.174284309731},{"$f":"J6","v":0},{"$f":"I7-J7","v":88105.174284309731},{"$f":"K7/(1+'Dateneingabe und Ergebnisse'!$F$58/100)^A7","v":83047.576853906809},{"$f":"M6+L7","v":968586.58101343084},2,0.80740245109740016,0.96858658101343087,161184.12991603071,null,null,20285.594370484207]
[3,null,null,{"$f":"D7","v":108390.76865479394},{"$f":"D8/(1+'Dateneingabe und Ergebnisse'!$F$58/100)^A8","v":99192.907885312554},906595.35898271273,0,null,{"$f":"I7","v":88105.174284309731},0,88105.174284309731,{"$f":"K8/(1+'Dateneingabe und Ergebnisse'!$F$58/100)^A8","v":80628.715392142534},1049215.2964055734,3,0.90659535898271271,1.0492152964055734,142619.93742286073,null,null,20285.594370484207]
{"$rows_left_out":30}
{"sheet":" t_TS --> OVC","index":10,"n_rows":20,"n_cols":13,"rows_kept":20,"cut":false,"hidden":true,"merged":[[7,1,7,2],[7,7,7,9],[6,7,6,12],[6,3,6,4],[7,10,7,12],[7,3,7,4],[6,1,6,2],[6,5,6,6],[7,5,7,6]]}
[]
[null,null,null,null,null,null,null,"K1",43.226801536014307,null,"K2",37.062622637840079]
[null,null,null,null,null,null,null,"n1",0.13981458755423726,null,"n2",0.16347407884956872]
[]
[]
[]
[null,"von Grafik",null,"von Excel",null,"von Excel verändert",null,"Potenzfunktion"]
["t_TS","OVC",null,"OVC",null,"OVC",null,"OVC",null,null,"OVC"]
{"$rows_left_out":13}
{"sheet":"Fixe Parameter","index":11,"n_rows":57,"n_cols":3,"rows_kept":57,"cut":false,"hidden":false,"merged":[]}
["Parameter","Einheit","Wert"]
["Sauerstoffsättigungskonzentration CS","mg/L",13]
["Sauerstoffkonzentration im Belebungsbecken CX","mg/L",1.5]
["spezifischer oTS-Gehalt ausgefaulter Schlamm","g oTS/(EW120·d)",20]
["CSB/oTS","–",1.45]
["N-Anteil im Überschussschlamm iN,ÜS","–",0.06]
["N/oTSPS =","–",0.06]
["Energiegehalt Methan","kWh/m³ CH4",10]
{"$rows_left_out":49}